3.2.27+grsecurity-2.9.1-3.2.27-201208112021 compile err

Discuss and suggest new grsecurity features

Moderators: spender, PaX Team

3.2.27+grsecurity-2.9.1-3.2.27-201208112021 compile err

Postby Troppauer » Sun Aug 12, 2012 7:36 am

Hi,

LD arch/x86/vdso/built-in.o
LD arch/x86/built-in.o
CHK kernel/config_data.h
CC drivers/char/random.o
drivers/char/random.c: In function 'transfer_latent_entropy':
drivers/char/random.c:841: error: too few arguments to function 'mix_pool_bytes'
drivers/char/random.c:842: error: too few arguments to function 'mix_pool_bytes'
make[2]: *** [drivers/char/random.o] Error 1
make[1]: *** [drivers/char] Error 2
make: *** [drivers] Error 2

Regards,
Hal
Troppauer
 
Posts: 11
Joined: Tue Sep 14, 2010 3:27 am
Location: Hungary

Re: 3.2.27+grsecurity-2.9.1-3.2.27-201208112021 compile err

Postby spender » Mon Aug 13, 2012 7:36 am

Hi,

It's been fixed in the most recent patch.

Thanks,
-Brad
spender
 
Posts: 2185
Joined: Wed Feb 20, 2002 8:00 pm
Location: VA, USA


Return to grsecurity development